Target
Oxidized purine nucleoside triphosphate hydrolase
Ligand
BDBM227637
Substrate
BDBM227640
Meas. Tech.
In Vitro MTH1 Enzymatic Assay
pH
7.5±n/a
IC50
2.2e+4± 5e+3 nM
Comments
extracted
Citation
 Kumar, AKawamura, TKawatani, MOsada, HZhang, KYJ Identification and structure-activity relationship of purine derivatives as novel MTH1 inhibitors. Chem Biol Drug Des 89:862-869 (2017)  
Target
Name:
Oxidized purine nucleoside triphosphate hydrolase
Synonyms:
7,8-dihydro-8-oxoguanine triphosphatase MTH1 NUDT1
Type:
Protein
Mol. Mass.:
22514.81
Organism:
Homo sapiens (Human)
Description:
P36639
Residue:
197
  
Inhibitor
Name:
BDBM227637
Synonyms:
MTH1 inhibitor, 131
Type:
Small organic molecule
Emp. Form.:
C10H13N5O
Mol. Mass.:
219.2431
SMILES:
C\C(CO)=C/CNc1ncnc2[nH]cnc12
:
Substrate
Name:
BDBM227640
Synonyms:
2-OH-dATP
Type:
Small organic molecule
Emp. Form.:
C10H16N5O13P3
Mol. Mass.:
507.181
SMILES:
Nc1nc(=O)[nH]c2n(cnc12)[C@H]1C[C@H](O)[C@@H](COP(O)(=O)OP(O)(=O)OP(O)(O)=O)O1
: