Target
Tyrosine-protein kinase JAK1
Ligand
BDBM229007
Substrate
Meas. Tech.
HTRF Biochemical Assay
Temperature
298.15±n/a K
IC50
0.1±n/a nM
Comments
extracted
Citation
 Brubaker, JChilders, MLChristopher, MClose, JTKatz, JDJung, JPeterson, SSiliphaivanh, PSiu, TSmith, GFTorres, LEWoo, HCYoung, JRZhang, H Cyanomethylpyrazole carboxamides as janus kinase inhibitors US Patent  US9328099 Publication Date 5/3/2016 
Target
Name:
Tyrosine-protein kinase JAK1
Synonyms:
JAK-1 JAK1A JAK1_HUMAN Janus kinase 1 (JAK1) | Janus kinase 1 JAK1
Type:
Protein
Mol. Mass.:
133293.73
Organism:
Homo sapiens (Human)
Description:
P23458
Residue:
1154
  
Inhibitor
Name:
BDBM229007
Synonyms:
US9328099, 10-1
Type:
Small organic molecule
Emp. Form.:
C22H26F3N7O4
Mol. Mass.:
509.4815
SMILES:
CC(C)(O)c1ccc(Nc2nn(cc2C(N)=O)C2(CC#N)CCN(CC2)C(=O)OCC(F)(F)F)cn1
: