Target
Tyrosine-protein kinase JAK1
Ligand
BDBM229428
Substrate
Meas. Tech.
HTRF Biochemical Assay
Temperature
298.15±n/a K
IC50
0.1±n/a nM
Comments
extracted
Citation
 Brubaker, JChilders, MLChristopher, MClose, JTKatz, JDJung, JPeterson, SSiliphaivanh, PSiu, TSmith, GFTorres, LEWoo, HCYoung, JRZhang, H Cyanomethylpyrazole carboxamides as janus kinase inhibitors US Patent  US9328099 Publication Date 5/3/2016 
Target
Name:
Tyrosine-protein kinase JAK1
Synonyms:
JAK-1 JAK1A JAK1_HUMAN Janus kinase 1 (JAK1) | Janus kinase 1 JAK1
Type:
Protein
Mol. Mass.:
133293.73
Organism:
Homo sapiens (Human)
Description:
P23458
Residue:
1154
  
Inhibitor
Name:
BDBM229428
Synonyms:
US9328099, 40-50
Type:
Small organic molecule
Emp. Form.:
C24H23F3N6O
Mol. Mass.:
468.4742
SMILES:
NC(=O)c1cn(nc1Nc1ccc(F)cc1)C1(CC#N)CCC(CC1)Nc1cc(F)ccc1F
: