Target
Tyrosine-protein kinase JAK1
Ligand
BDBM229484
Substrate
Meas. Tech.
HTRF Biochemical Assay
Temperature
298.15±n/a K
IC50
0.03±n/a nM
Comments
extracted
Citation
 Brubaker, JChilders, MLChristopher, MClose, JTKatz, JDJung, JPeterson, SSiliphaivanh, PSiu, TSmith, GFTorres, LEWoo, HCYoung, JRZhang, H Cyanomethylpyrazole carboxamides as janus kinase inhibitors US Patent  US9328099 Publication Date 5/3/2016 
Target
Name:
Tyrosine-protein kinase JAK1
Synonyms:
JAK-1 JAK1A JAK1_HUMAN Janus kinase 1 (JAK1) | Janus kinase 1 JAK1
Type:
Protein
Mol. Mass.:
133293.73
Organism:
Homo sapiens (Human)
Description:
P23458
Residue:
1154
  
Inhibitor
Name:
BDBM229484
Synonyms:
US9328099, 41-10
Type:
Small organic molecule
Emp. Form.:
C24H25ClFN7O
Mol. Mass.:
481.953
SMILES:
NC(=O)c1cn(nc1Nc1ccnc(F)c1)C1(CC#N)CCC(CC1)NCc1ccccc1Cl
: