Target
Tyrosine-protein kinase JAK1
Ligand
BDBM229502
Substrate
Meas. Tech.
HTRF Biochemical Assay
Temperature
298.15±n/a K
IC50
0.05±n/a nM
Comments
extracted
Citation
 Brubaker, JChilders, MLChristopher, MClose, JTKatz, JDJung, JPeterson, SSiliphaivanh, PSiu, TSmith, GFTorres, LEWoo, HCYoung, JRZhang, H Cyanomethylpyrazole carboxamides as janus kinase inhibitors US Patent  US9328099 Publication Date 5/3/2016 
Target
Name:
Tyrosine-protein kinase JAK1
Synonyms:
JAK-1 JAK1A JAK1_HUMAN Janus kinase 1 (JAK1) | Janus kinase 1 JAK1
Type:
Protein
Mol. Mass.:
133293.73
Organism:
Homo sapiens (Human)
Description:
P23458
Residue:
1154
  
Inhibitor
Name:
BDBM229502
Synonyms:
US9328099, 43-4
Type:
Small organic molecule
Emp. Form.:
C19H19F4N7O2
Mol. Mass.:
453.3935
SMILES:
CC(F)(F)C(=O)N1CC[C@](CC#N)([C@@H](F)C1)n1cc(C(N)=O)c(Nc2ccc(F)nc2)n1
: