Target
Muscarinic acetylcholine receptor M3
Ligand
BDBM228846
Substrate
Meas. Tech.
[3H]-NMS Binding Assay
IC50
31±n/a nM
Citation
 Fernandez Forner, MDPrat Quinones, MBuil Albero, MA Quinuclidine derivatives and medicinal compositions containing the same US Patent  US9333195 Publication Date 5/10/2016 
Target
Name:
Muscarinic acetylcholine receptor M3
Synonyms:
ACM3_HUMAN Cholinergic, muscarinic M3 Muscarinic receptor M3 | RecName: Full=Muscarinic acetylcholine receptor M3
Type:
Enzyme
Mol. Mass.:
66151.03
Organism:
Homo sapiens (Human)
Description:
P20309
Residue:
590
  
Inhibitor
Name:
BDBM228846
Synonyms:
US9333195, 1
Type:
Small Organic Molecule
Emp. Form.:
C30H34NO3
Mol. Mass.:
456.5953
SMILES:
O=C(O[C@@H]1CC2CC[N+]1(CCCOc1ccccc1)CC2)C(c1ccccc1)c1ccccc1
: