Target
Genome polyprotein [1028-1200,1251-1711]
Ligand
BDBM229587
Substrate
EC50
3.51±n/a nM
Citation
 Gillis, EPBowsher, MSScola, PM Hepatitis C virus inhibitors US Patent  US9334279 Publication Date 5/10/2016 
Target
Name:
Genome polyprotein [1028-1200,1251-1711]
Synonyms:
NS3/4A protease | POLG_HCVJ4
Type:
Mol. Mass.:
67564.11
Organism:
Hepatitis C virus genotype 1b (strain J4L2S) (HCV)
Description:
amino acids 1027 to 1711
Residue:
634
  
Inhibitor
Name:
BDBM229587
Synonyms:
US9334279, 1063
Type:
Small organic molecule
Emp. Form.:
C37H47F3N6O8S2
Mol. Mass.:
824.93
SMILES:
CC[C@@H]1C[C@H](C)CC\C=C/[C@@H]2C[C@]2(NC(=O)[C@@H]2C[C@H](CN2C(=O)[C@H]1NC(=O)OC(C)(C)C(F)(F)F)Oc1ccc(cn1)-c1nccs1)C(=O)NS(=O)(=O)C1CC1
: