Target
Genome polyprotein [1027-1711]
Ligand
BDBM229588
Substrate
Meas. Tech.
Reporter Assay
Temperature
310.15±n/a K
EC50
3±2 nM
Comments
extracted
Citation
 Gillis, EPBowsher, MSScola, PM Hepatitis C virus inhibitors US Patent  US9334279 Publication Date 5/10/2016 
Target
Name:
Genome polyprotein [1027-1711]
Synonyms:
NS3-NS4A Protease POLG_HCV77
Type:
Mol. Mass.:
72913.15
Organism:
Hepatitis C virus genotype 1a (strain H77) (HCV)
Description:
amino acids 1027 to 1711
Residue:
685
  
Inhibitor
Name:
BDBM229588
Synonyms:
US9334279, 1064
Type:
Small organic molecule
Emp. Form.:
C37H47F3N6O8S2
Mol. Mass.:
824.93
SMILES:
C[C@@H]1CC\C=C/[C@@H]2C[C@]2(NC(=O)[C@@H]2C[C@H](CN2C(=O)[C@@H](NC(=O)OC(C)(C)C(F)(F)F)[C@H](C)C1)Oc1ccc(cn1)-c1nccs1)C(=O)NS(=O)(=O)C1(C)CC1
: