Target
Beta-glucuronidase
Ligand
BDBM163639
Substrate
Meas. Tech.
Activity Assay
IC50
1058.2±3.54 nM
Citation
 Redinbo, MR Selective β-glucuronidase inhibitors as a treatment for side effects of camptothecin antineoplastic agents US Patent  US9334288 Publication Date 5/10/2016 
Target
Name:
Beta-glucuronidase
Synonyms:
β-Glucuronidase Beta-G1 GUSB | beta-Glucuronidase (β-glucuronidase)
Type:
Protein
Mol. Mass.:
74736.05
Organism:
Homo sapiens (Human)
Description:
Residue:
651
  
Inhibitor
Name:
BDBM163639
Synonyms:
Methyl 2({[(6ethyl2oxo1,2dihydroquinolin3yl)methyl](2 hydroxyethyl)carbamothioyl}amino)benzoate (Inh 4) | US9334288, 6
Type:
Small organic molecule
Emp. Form.:
C23H25N3O4S
Mol. Mass.:
439.527
SMILES:
CCc1ccc2[nH]c(=O)c(CN(CCO)C(=S)Nc3ccccc3C(=O)OC)cc2c1
: