Target
TGF-beta receptor type-1
Ligand
BDBM111122
Substrate
Meas. Tech.
ALK1-6 enzymatic assays
pH
7.5±n/a
IC50
20586±n/a nM
Comments
extracted
Citation
 Alimardanov, ACuny, GDGrewal, GSLee, AMcKew, JCMohedas, AHShen, MXu, XYu, PB BMP inhibitors and methods of use thereof US Patent  US9682983 Publication Date 6/20/2017 
Target
Name:
TGF-beta receptor type-1
Synonyms:
ALK-5 Activin A receptor type II-like protein kinase of 53kD SKR4 TGF-beta receptor type I TGFBR1 TGFR1_HUMAN Transforming growth factor-beta receptor type I
Type:
enzyme
Mol. Mass.:
55968.24
Organism:
Homo sapiens (Human)
Description:
P36897
Residue:
503
  
Inhibitor
Name:
BDBM111122
Synonyms:
US10017516, Compound 17 US9682983, 17
Type:
Small organic molecule
Emp. Form.:
C24H21N7
Mol. Mass.:
407.4704
SMILES:
C1CN(CCN1)c1ccc(cn1)-c1cnc2c(cnn2c1)-c1ccnc2ccccc12
: