Target
Activin receptor type-1B
Ligand
BDBM143246
Substrate
Meas. Tech.
ALK1-6 enzymatic assays
pH
7.5±n/a
IC50
353±n/a nM
Comments
extracted
Citation
 Alimardanov, ACuny, GDGrewal, GSLee, AMcKew, JCMohedas, AHShen, MXu, XYu, PB BMP inhibitors and methods of use thereof US Patent  US9682983 Publication Date 6/20/2017 
Target
Name:
Activin receptor type-1B
Synonyms:
ACV1B_HUMAN ACVRLK4 Activin receptor type-1B/Activin receptor-like kinase 4 (ALK-4)
Type:
PROTEIN
Mol. Mass.:
56810.99
Organism:
Homo sapiens (Human)
Description:
ChEMBL_587064
Residue:
505
  
Inhibitor
Name:
BDBM143246
Synonyms:
US10017516, Compound 8 | US9682983, 8
Type:
Small organic molecule
Emp. Form.:
C25H21ClN6
Mol. Mass.:
440.927
SMILES:
Clc1cc(-c2cnn3cc(cnc23)-c2ccc(cc2)N2CCNCC2)c2ccccc2n1
: