Target
Bone morphogenetic protein receptor type-1A
Ligand
BDBM143282
Substrate
Meas. Tech.
ALK1-6 enzymatic assays
pH
7.5±n/a
IC50
54±n/a nM
Comments
extracted
Citation
 Alimardanov, ACuny, GDGrewal, GSLee, AMcKew, JCMohedas, AHShen, MXu, XYu, PB BMP inhibitors and methods of use thereof US Patent  US9682983 Publication Date 6/20/2017 
Target
Name:
Bone morphogenetic protein receptor type-1A
Synonyms:
ACVRLK3 Activin receptor-like kinase 3 (ALK-3) BMR1A_HUMAN
Type:
Enzyme
Mol. Mass.:
60204.46
Organism:
Homo sapiens (Human)
Description:
P36894
Residue:
532
  
Inhibitor
Name:
BDBM143282
Synonyms:
US10017516, Compound 10 | US9682983, 10
Type:
Small organic molecule
Emp. Form.:
C26H24N6
Mol. Mass.:
420.509
SMILES:
Cc1cc(-c2cnn3cc(cnc23)-c2ccc(cc2)N2CCNCC2)c2ccccc2n1
: