Target
Bone morphogenetic protein receptor type-1B
Ligand
BDBM148349
Substrate
Meas. Tech.
ALK1-6 enzymatic assays
pH
7.5±n/a
IC50
106±n/a nM
Comments
extracted
Citation
 Alimardanov, ACuny, GDGrewal, GSLee, AMcKew, JCMohedas, AHShen, MXu, XYu, PB BMP inhibitors and methods of use thereof US Patent  US9682983 Publication Date 6/20/2017 
Target
Name:
Bone morphogenetic protein receptor type-1B
Synonyms:
ALK-6 BMPR1B Bone morphogenetic protein receptor type-1B (BMPR1B)
Type:
Enzyme
Mol. Mass.:
56939.41
Organism:
Homo sapiens (Human)
Description:
O00238
Residue:
502
  
Inhibitor
Name:
BDBM148349
Synonyms:
US10017516, Compound 23 | US9682983, 23
Type:
Small organic molecule
Emp. Form.:
C26H23N7O
Mol. Mass.:
449.5071
SMILES:
NC(=O)c1cccc2c(ccnc12)-c1cnn2cc(cnc12)-c1ccc(cc1)N1CCNCC1
: