Target
Bone morphogenetic protein receptor type-1A
Ligand
BDBM148388
Substrate
Meas. Tech.
ALK1-6 enzymatic assays
pH
7.5±n/a
IC50
225±n/a nM
Comments
extracted
Citation
 Alimardanov, ACuny, GDGrewal, GSLee, AMcKew, JCMohedas, AHShen, MXu, XYu, PB BMP inhibitors and methods of use thereof US Patent  US9682983 Publication Date 6/20/2017 
Target
Name:
Bone morphogenetic protein receptor type-1A
Synonyms:
ACVRLK3 Activin receptor-like kinase 3 (ALK-3) BMR1A_HUMAN
Type:
Enzyme
Mol. Mass.:
60204.46
Organism:
Homo sapiens (Human)
Description:
P36894
Residue:
532
  
Inhibitor
Name:
BDBM148388
Synonyms:
US10017516, Compound 37 | US9682983, 37
Type:
Small organic molecule
Emp. Form.:
C26H21N7
Mol. Mass.:
431.4918
SMILES:
N#Cc1cc(ccc1N1CCNCC1)-c1cnc2c(cnn2c1)-c1ccnc2ccccc12
: