Target
Activin receptor type-1
Ligand
BDBM160069
Substrate
Meas. Tech.
ALK1-6 enzymatic assays
pH
7.5±n/a
IC50
15±n/a nM
Comments
extracted
Citation
 Alimardanov, ACuny, GDGrewal, GSLee, AMcKew, JCMohedas, AHShen, MXu, XYu, PB BMP inhibitors and methods of use thereof US Patent  US9682983 Publication Date 6/20/2017 
Target
Name:
Activin receptor type-1
Synonyms:
2.7.11.30 ACVR1 ACVRLK2 ALK2/ACVR1 Activin receptor-like kinase 2 Activin receptor-like kinase 2 (ALK2/ACVR1) SKR1 TGF-B superfamily receptor type I | TSR-I
Type:
Mol. Mass.:
57158.32
Organism:
Homo sapiens (Human)
Description:
Residue:
509
  
Inhibitor
Name:
BDBM160069
Synonyms:
US10017516, Compound 39 | US9682983, 39
Type:
Small organic molecule
Emp. Form.:
C25H21FN6
Mol. Mass.:
424.4728
SMILES:
Fc1cc(ccc1N1CCNCC1)-c1cnc2c(cnn2c1)-c1ccnc2ccccc12
: