Target
Activin receptor type-1B
Ligand
BDBM161916
Substrate
Meas. Tech.
ALK1-6 enzymatic assays
pH
7.5±n/a
IC50
10800±n/a nM
Comments
extracted
Citation
 Alimardanov, ACuny, GDGrewal, GSLee, AMcKew, JCMohedas, AHShen, MXu, XYu, PB BMP inhibitors and methods of use thereof US Patent  US9682983 Publication Date 6/20/2017 
Target
Name:
Activin receptor type-1B
Synonyms:
ACV1B_HUMAN ACVRLK4 Activin receptor type-1B/Activin receptor-like kinase 4 (ALK-4)
Type:
PROTEIN
Mol. Mass.:
56810.99
Organism:
Homo sapiens (Human)
Description:
ChEMBL_587064
Residue:
505
  
Inhibitor
Name:
BDBM161916
Synonyms:
US10017516, Compound 48' | US9682983, 48
Type:
Small organic molecule
Emp. Form.:
C28H28N6O
Mol. Mass.:
464.5615
SMILES:
Cc1ccc2c(cccc2n1)-c1cnn2cc(cnc12)-c1ccc(OCCN2CCCCC2)cn1
: