Target
Activin receptor type-1B
Ligand
BDBM161930
Substrate
Meas. Tech.
ALK1-6 enzymatic assays
pH
7.5±n/a
IC50
48280±n/a nM
Comments
extracted
Citation
 Alimardanov, ACuny, GDGrewal, GSLee, AMcKew, JCMohedas, AHShen, MXu, XYu, PB BMP inhibitors and methods of use thereof US Patent  US9682983 Publication Date 6/20/2017 
Target
Name:
Activin receptor type-1B
Synonyms:
ACV1B_HUMAN ACVRLK4 Activin receptor type-1B/Activin receptor-like kinase 4 (ALK-4)
Type:
PROTEIN
Mol. Mass.:
56810.99
Organism:
Homo sapiens (Human)
Description:
ChEMBL_587064
Residue:
505
  
Inhibitor
Name:
BDBM161930
Synonyms:
US10017516, Compound 62 | US9682983, 62
Type:
Small organic molecule
Emp. Form.:
C26H24N6O
Mol. Mass.:
436.5084
SMILES:
Cc1ccc2c(cccc2n1)-c1cnn2cc(cnc12)-c1ccc(OC2CCNCC2)cn1
: