Target
Potassium voltage-gated channel subfamily H member 2
Ligand
BDBM291377
Substrate
Meas. Tech.
hERG Assay
pH
7.3±n/a
Temperature
298.15±n/a K
IC50
5500±n/a nM
Comments
extracted
Citation
 Patient, LEvans, DSimpson, IPowell, A Compounds US Patent  US9580415 Publication Date 2/28/2017 
Target
Name:
Potassium voltage-gated channel subfamily H member 2
Synonyms:
1,3-beta-glucan synthase component GLS2 ERG Eag-related protein 1 Ether-a-go-go-related gene (HERG) Ether-a-go-go-related gene potassium channel 1 Ether-a-go-go-related gene potassium channel 1 (hERG1) Ether-a-go-go-related protein 1 H-ERG KCNH2 Potassium voltage-gated channel subfamily H member 2 (hERG) Voltage-gated potassium channel subunit Kv11.1 hERG Potassium Channel 1 | putative potassium channel subunit
Type:
Multi-pass membrane protein
Mol. Mass.:
126672.65
Organism:
Homo sapiens (Human)
Description:
Q12809
Residue:
1159
  
Inhibitor
Name:
BDBM291377
Synonyms:
4-[1-(4-Chlorophenyl)-2-(1-methyl-1H-pyrazol-5-yl)-1H-pyrrolo[2,3-c]pyridin-3-yl]piperidine-1-carboxamide | US9580415, Example 11
Type:
Small organic molecule
Emp. Form.:
C23H23ClN6O
Mol. Mass.:
434.921
SMILES:
Cn1nccc1-c1c(C2CCN(CC2)C(N)=O)c2ccncc2n1-c1ccc(Cl)cc1
: