Target
Sodium channel protein type 9 subunit alpha
Ligand
BDBM229596
Substrate
Meas. Tech.
FLIPR Assay
pH
7.3±n/a
IC50
>20000±n/a nM
Comments
extracted
Citation
 Park, JH Pyridine and piperidine derivatives as novel sodium channel blockers US Patent  US9340504 Publication Date 5/17/2016 
Target
Name:
Sodium channel protein type 9 subunit alpha
Synonyms:
NENA Peripheral sodium channel 1 SCN9A_HUMAN Voltage-gated sodium channel subunit Nav1.7 hNE-Na
Type:
Protein
Mol. Mass.:
226375.97
Organism:
Homo sapiens (Human)
Description:
Q15858
Residue:
1988
  
Inhibitor
Name:
BDBM229596
Synonyms:
US9340504, 8
Type:
Small Organic Molecule
Emp. Form.:
C19H15F3N2O2
Mol. Mass.:
360.3298
SMILES:
Oc1ccccc1Cc1cccc(n1)-c1ccc(OCC(F)(F)F)nc1
: