Target
Hexokinase-4
Ligand
BDBM229608
Substrate
Meas. Tech.
Coupled Enzymatic Assay
pH
7.2±n/a
EC50
93±0 nM
Comments
extracted
Citation
 Bhuniya, DDeshpande, AKandalkar, SKobal, BKurhade, SVyavahare, VKaduskar, R Acetamide derivatives as glucokinase activators, their process and medicinal applications US Patent  US9340506 Publication Date 5/17/2016 
Target
Name:
Hexokinase-4
Synonyms:
GCK Glucokinase (GK) HK IV HXK4_HUMAN Hexokinase-D
Type:
Enzyme
Mol. Mass.:
52175.81
Organism:
Homo sapiens (Human)
Description:
P35557
Residue:
465
  
Inhibitor
Name:
BDBM229608
Synonyms:
US9340506, B-9
Type:
Small Organic Molecule
Emp. Form.:
C28H22F2N2O7S2
Mol. Mass.:
600.61
SMILES:
Cc1cc(Oc2cnc(NC(=O)C(Oc3ccc(F)cc3F)c3ccc(cc3)S(=O)(=O)C3CC3)s2)ccc1C(O)=O
: