Target
Sodium/glucose cotransporter 1
Ligand
BDBM228496
Substrate
Meas. Tech.
SGLT1 Inhibition Assay
pH
7.4±n/a
Temperature
310.15±n/a K
IC50
33.7±n/a nM
Comments
extracted
Citation
 Choi, SKim, JESong, KLee, SHPark, KSeo, HJKim, MJPark, EPark, SOKong, YKang, HSon, IJung, MECha, MKim, HJLee, JSKim, MLee, MWLee, K Method for dual inhibition of SGLT1 and SGLT2 using diphenylmethane derivatives US Patent  US9340521 Publication Date 5/17/2016 
Target
Name:
Sodium/glucose cotransporter 1
Synonyms:
High affinity sodium-glucose cotransporter Na(+)/glucose cotransporter 1 SGLT1 Sodium-dependent glucose cotransporter 1 (SGLT1) Sodium/glucose cotransporter 1 (SGLT1) | Solute carrier family 5 member 1
Type:
Protein
Mol. Mass.:
73503.78
Organism:
Homo sapiens (Human)
Description:
P13866
Residue:
664
  
Inhibitor
Name:
BDBM228496
Synonyms:
US9340521, E048
Type:
Small organic molecule
Emp. Form.:
C23H27ClO5S
Mol. Mass.:
450.975
SMILES:
COc1ccc(Cc2cc([C@@H]3O[C@H](SC)[C@@H](O)[C@H](O)[C@H]3O)c3CCCc3c2Cl)cc1
: