Target
Kappa-type opioid receptor
Ligand
BDBM228517
Substrate
Meas. Tech.
Radioligand Dose-Displacement Binding Assay
pH
7.4±n/a
Ki
4285±1087 nM
Comments
extracted
Citation
 Lockman, J Propellane-based compounds and the use thereof US Patent  US9340542 Publication Date 5/17/2016 
Target
Name:
Kappa-type opioid receptor
Synonyms:
K-OR-1 Kappa-opioid receptor (KOR) Kappa-type opioid receptor (KOR) OPIATE Kappa OPRK1 kappa opioid receptor (KOR)
Type:
G Protein-Coupled Receptor (GPCR)
Mol. Mass.:
42648.76
Organism:
Homo sapiens (Human)
Description:
P41145
Residue:
380
  
Inhibitor
Name:
BDBM228517
Synonyms:
US9340542, 6
Type:
Small organic molecule
Emp. Form.:
C25H29N3O3
Mol. Mass.:
419.5161
SMILES:
COc1ccc2C[C@@]34CN(CC5CC5)CC[C@@]3(Cc3[nH]c(=O)c(cc3C4)C(N)=O)c2c1
: