Target
Vascular endothelial growth factor receptor 1
Ligand
BDBM228547
Substrate
Meas. Tech.
FLIPR (Fluorometric Imaging Plate Reader) Technology Assay
IC50
69±n/a nM
Citation
 Guo, XZhu, Z Compounds as tyrosine kinase modulators US Patent  US9340555 Publication Date 5/17/2016 
Target
Name:
Vascular endothelial growth factor receptor 1
Synonyms:
FLT FRT Fms-like tyrosine kinase 1 Tyrosine-protein kinase FRT VEGFR-1 VGFR1_HUMAN Vascular endothelial growth factor receptor 1 (FLT1) Vascular endothelial growth factor receptor 1 and 2 (Flt-1 and KDR) Vascular permeability factor receptor vascular endothelial growth factor/vascular permeability factor receptor
Type:
Receptor Tyrosine Kinase
Mol. Mass.:
150800.23
Organism:
Homo sapiens (Human)
Description:
P17948
Residue:
1338
  
Inhibitor
Name:
BDBM228547
Synonyms:
US9340555, 33
Type:
Small organic molecule
Emp. Form.:
C29H29F2N5O5S
Mol. Mass.:
597.633
SMILES:
Cc1ccc(F)c(NC(=O)Nc2ccc(Oc3ccnc4cc(sc34)C(=O)NCCNC(=O)OC(C)(C)C)cc2F)c1
: