Target
Cathepsin B
Ligand
BDBM228617
Substrate
Meas. Tech.
Inhibition Assay
pH
5.8±n/a
IC50
>1000000±n/a nM
Comments
extracted
Citation
 Lee, JYin, FBogyo, MSEdgington, LE Specific inhibitors and active site probes for legumain US Patent  US9345789 Publication Date 5/24/2016 
Target
Name:
Cathepsin B
Synonyms:
APP secretase CATB_HUMAN CTSB Cathepsin B light chain | Cathepsin B1
Type:
Enzyme
Mol. Mass.:
37819.69
Organism:
Homo sapiens (Human)
Description:
gi_63102437
Residue:
339
  
Inhibitor
Name:
BDBM228617
Synonyms:
US9345789, LI-0
Type:
Small organic molecule
Emp. Form.:
C21H26N2O7
Mol. Mass.:
418.4403
SMILES:
CC(=O)N1CCC[C@H]1C(=O)N[C@@H](CC(O)=O)C(=O)COC(=O)c1c(C)cccc1C
: