Target
Tyrosine-protein kinase JAK1 [866-1154]
Ligand
BDBM228705
Substrate
Meas. Tech.
Enzymatic Assay
Temperature
298.15±n/a K
IC50
0.055±0.055 nM
Comments
extracted
Citation
 Su, WDeng, WLi, JJi, J Pyrrolopyrimidine compounds and uses thereof US Patent  US9346810 Publication Date 5/24/2016 
Target
Name:
Tyrosine-protein kinase JAK1 [866-1154]
Synonyms:
JAK1 JAK1A JAK1_HUMAN Tyrosine-protein kinase JAK1 (aa 866-1154)
Type:
Protein
Mol. Mass.:
33185.74
Organism:
Homo sapiens (Human)
Description:
P23458[866-1154]
Residue:
289
  
Inhibitor
Name:
BDBM228705
Synonyms:
US10369153, Compound 252 | US9346810, 252
Type:
Small Organic Molecule
Emp. Form.:
C20H25N7O3S
Mol. Mass.:
443.523
SMILES:
CN([C@@H]1CCN(C1)c1ncnc2[nH]ccc12)c1ccc(cn1)S(=O)(=O)N1CCOCC1
: