Target
Tyrosine-protein kinase JAK2 [808-1132]
Ligand
BDBM228645
Substrate
Meas. Tech.
Enzymatic Assay
Temperature
298.15±n/a K
IC50
0.055±0.055 nM
Comments
extracted
Citation
 Su, WDeng, WLi, JJi, J Pyrrolopyrimidine compounds and uses thereof US Patent  US9346810 Publication Date 5/24/2016 
Target
Name:
Tyrosine-protein kinase JAK2 [808-1132]
Synonyms:
JAK2 Janus kinase 2 (JAK2) Tyrosine-protein kinase JAK2 (808-1132)
Type:
Mol. Mass.:
37984.02
Organism:
Homo sapiens (Human)
Description:
808-1132 aa of O60674
Residue:
325
  
Inhibitor
Name:
BDBM228645
Synonyms:
US10111875, Compound 47 US9346810, 47
Type:
Small organic molecule
Emp. Form.:
C12H18N6O2S
Mol. Mass.:
310.375
SMILES:
CNS(=O)(=O)N(C)[C@@H]1CCN(C1)c1ncnc2[nH]ccc12
: