Target
Beta-galactosidase [24-677]
Ligand
BDBM228802
Substrate
4-Methylumbelliferyl-β-D-galactopyranoside
Meas. Tech.
β-Gal Inhibitory Assay
pH
4.5±n/a
Temperature
310.15±n/a K
Ki
6.83e+4±n/a nM
Citation
 Suzuki, HOhto, UHigaki, KMena-Barragán, TAguilar-Moncayo, MOrtiz Mellet, CNanba, EGarcia Fernandez, JMSuzuki, YShimizu, T Structural basis of pharmacological chaperoning for human ß-galactosidase. J Biol Chem 289:14560-8 (2014)  
Target
Name:
Beta-galactosidase [24-677]
Synonyms:
BGAL_HUMAN GLB1 | beta-Galactosidase (β-Gal)
Type:
Enzyme
Mol. Mass.:
73588.24
Organism:
Homo sapiens (Human)
Description:
Human β-Gal (24-677 aa)
Residue:
654
  
Inhibitor
Name:
BDBM228802
Synonyms:
5N,6S-(N'-butyliminomethylidene)-6-thio-1-deoxygalactonojirimycin | 6S-NBI-DGJ
Type:
Small organic molecule
Emp. Form.:
C11H20N2O3S
Mol. Mass.:
260.353
SMILES:
CCCC\N=C1/SC[C@@H]2[C@H](O)[C@H](O)[C@@H](O)CN12
:
Substrate
Name:
BDBM50361738
Synonyms:
CHEMBL1393422
Type:
Small organic molecule
Emp. Form.:
C16H18O8
Mol. Mass.:
338.3093
SMILES:
Cc1cc(=O)oc2cc(O[C@@H]3O[C@H](CO)[C@H](O)[C@H](O)[C@H]3O)ccc12
: