Target
Acyl-[acyl-carrier-protein]--UDP-N-acetylglucosamine O-acyltransferase
Ligand
BDBM228806
Substrate
Meas. Tech.
Fluorescence Polarization Assay
pH
8±n/a
Kd
1.7e+4± 1.6e+3 nM
Comments
extracted
Citation
 Jenkins, RJHeslip, KAMeagher, JLStuckey, JADotson, GD Structural basis for the recognition of peptide RJPXD33 by acyltransferases in lipid A biosynthesis. J Biol Chem 289:15527-35 (2014)  
Target
Name:
Acyl-[acyl-carrier-protein]--UDP-N-acetylglucosamine O-acyltransferase
Synonyms:
LPXA_ECOLI lpxA
Type:
Enzyme
Mol. Mass.:
28083.70
Organism:
Escherichia coli (Enterobacteria)
Description:
P0A722
Residue:
262
  
Inhibitor
Name:
BDBM228806
Synonyms:
FITC-(βa)TNLYMLPKWDIP-CONH2 | FITC-RJPXD33
Type:
Small organic molecule
Emp. Form.:
C95H124N18O23S2
Mol. Mass.:
1950.238
SMILES:
CC[C@H](C)[C@H](NC(=O)[C@H](CC(O)=O)NC(=O)[C@H](Cc1c[nH]c2ccccc12)NC(=O)[C@H](CCCCN)NC(=O)[C@@H]1CCCN1C(=O)[C@H](CC(C)C)NC(=O)[C@H](CCSC)NC(=O)[C@H](Cc1ccc(O)cc1)NC(=O)[C@H](CC(C)C)NC(=O)[C@H](CC(N)=O)NC(=O)[C@@H](NC(=O)CCNC(=S)Nc1ccc(c(c1)C(O)=O)-c1c2ccc(O)cc2oc2cc(=O)ccc12)[C@@H](C)O)C(=O)N1CCC[C@H]1C(N)=O
: