Target
Tyrosine-protein kinase BTK
Ligand
BDBM291388
Substrate
Meas. Tech.
Enzyme Assay
pH
7.5±n/a
Temperature
300.15±n/a K
IC50
<100±n/a nM
Comments
extracted
Citation
 Hodous, BLLiu-Bujalski, LJones, RBankston, DJohnson, TLMochalkin, INguyen, NQiu, HGoutopoulos, ABrugger, N Compositions and methods for the production of pyrimidine and pyridine compounds with BTK inhibitory activity US Patent  US9580449 Publication Date 2/28/2017 
Target
Name:
Tyrosine-protein kinase BTK
Synonyms:
AGMX1 Agammaglobulinaemia tyrosine kinase B cell progenitor kinase BPK BTK_HUMAN Tyrosine Kinase BTK Tyrosine-protein kinase BTK (BTK)
Type:
Enzyme
Mol. Mass.:
76289.95
Organism:
Homo sapiens (Human)
Description:
Q06187
Residue:
659
  
Inhibitor
Name:
BDBM291388
Synonyms:
(R)-1-(3-((6-amino-5-(4-phenoxyphenyl)pyrimidin-4-yl)amino)pyrrolidin-1-yl)prop-2-en-1-one US9580449, Example A1
Type:
Small organic molecule
Emp. Form.:
C23H23N5O2
Mol. Mass.:
401.461
SMILES:
Nc1ncnc(N[C@@H]2CCN(C2)C(=O)C=C)c1-c1ccc(Oc2ccccc2)cc1
: