Target
Tyrosine-protein kinase BTK
Ligand
BDBM291399
Substrate
Meas. Tech.
Enzyme Assay
pH
7.5±n/a
Temperature
300.15±n/a K
IC50
<100±n/a nM
Comments
extracted
Citation
 Hodous, BLLiu-Bujalski, LJones, RBankston, DJohnson, TLMochalkin, INguyen, NQiu, HGoutopoulos, ABrugger, N Compositions and methods for the production of pyrimidine and pyridine compounds with BTK inhibitory activity US Patent  US9580449 Publication Date 2/28/2017 
Target
Name:
Tyrosine-protein kinase BTK
Synonyms:
AGMX1 Agammaglobulinaemia tyrosine kinase B cell progenitor kinase BPK BTK_HUMAN Tyrosine Kinase BTK Tyrosine-protein kinase BTK (BTK)
Type:
Enzyme
Mol. Mass.:
76289.95
Organism:
Homo sapiens (Human)
Description:
Q06187
Residue:
659
  
Inhibitor
Name:
BDBM291399
Synonyms:
1-((3S,4S)-4-(((6-amino-5-(1-benzyl-1H-pyrazol-4-yl)pyrimidin-4-yl)amino)methyl)-3-hydroxypiperidin-1-yl)prop-2-yn-1-one US9580449, Example A110
Type:
Small organic molecule
Emp. Form.:
C23H25N7O2
Mol. Mass.:
431.4903
SMILES:
Nc1ncnc(NC[C@@H]2CCN(C[C@H]2O)C(=O)C#C)c1-c1cnn(Cc2ccccc2)c1
: