Target
Tyrosine-protein kinase BTK
Ligand
BDBM291539
Substrate
Meas. Tech.
Enzyme Assay
pH
7.5±n/a
Temperature
300.15±n/a K
IC50
<100±n/a nM
Comments
extracted
Citation
 Hodous, BLLiu-Bujalski, LJones, RBankston, DJohnson, TLMochalkin, INguyen, NQiu, HGoutopoulos, ABrugger, N Compositions and methods for the production of pyrimidine and pyridine compounds with BTK inhibitory activity US Patent  US9580449 Publication Date 2/28/2017 
Target
Name:
Tyrosine-protein kinase BTK
Synonyms:
AGMX1 Agammaglobulinaemia tyrosine kinase B cell progenitor kinase BPK BTK_HUMAN Tyrosine Kinase BTK Tyrosine-protein kinase BTK (BTK)
Type:
Enzyme
Mol. Mass.:
76289.95
Organism:
Homo sapiens (Human)
Description:
Q06187
Residue:
659
  
Inhibitor
Name:
BDBM291539
Synonyms:
N-((1s,4s)-4-((6-amino-5-(4-phenoxyphenyl)pyrimidin-4-yl)amino)cyclohexyl)acrylamide US9580449, Example A266
Type:
Small organic molecule
Emp. Form.:
C25H27N5O2
Mol. Mass.:
429.5142
SMILES:
Nc1ncnc(N[C@@H]2CC[C@@H](CC2)NC(=O)C=C)c1-c1ccc(Oc2ccccc2)cc1
: