Target
Sodium channel protein type 9 subunit alpha
Ligand
BDBM229690
Substrate
Meas. Tech.
Cell-Based Assay
IC50
300±n/a nM
Citation
 Bregman, HBuchanan, JLChakka, NDimauro, EFDu, BNguyen, HNZheng, XM Carboxamides as inhibitors of voltage-gated sodium channels US Patent  US9334269 Publication Date 5/10/2016 
Target
Name:
Sodium channel protein type 9 subunit alpha
Synonyms:
NENA Peripheral sodium channel 1 SCN9A_HUMAN Voltage-gated sodium channel subunit Nav1.7 hNE-Na
Type:
Protein
Mol. Mass.:
226375.97
Organism:
Homo sapiens (Human)
Description:
Q15858
Residue:
1988
  
Inhibitor
Name:
BDBM229690
Synonyms:
US9334269, 17
Type:
Small organic molecule
Emp. Form.:
C22H24N6O2
Mol. Mass.:
404.465
SMILES:
CCc1cccc(OC2CN(C2)c2ncnc(Nc3cccc(c3)C(=O)NC)n2)c1
: