Target
Sodium channel protein type 9 subunit alpha
Ligand
BDBM229713
Substrate
Meas. Tech.
Cell-Based Assay
IC50
500±n/a nM
Citation
 Bregman, HBuchanan, JLChakka, NDimauro, EFDu, BNguyen, HNZheng, XM Carboxamides as inhibitors of voltage-gated sodium channels US Patent  US9334269 Publication Date 5/10/2016 
Target
Name:
Sodium channel protein type 9 subunit alpha
Synonyms:
NENA Peripheral sodium channel 1 SCN9A_HUMAN Voltage-gated sodium channel subunit Nav1.7 hNE-Na
Type:
Protein
Mol. Mass.:
226375.97
Organism:
Homo sapiens (Human)
Description:
Q15858
Residue:
1988
  
Inhibitor
Name:
BDBM229713
Synonyms:
US9334269, 40
Type:
Small organic molecule
Emp. Form.:
C21H21ClN6O2
Mol. Mass.:
424.883
SMILES:
CNC(=O)c1cccc(Nc2ncnc(n2)N2CC(COc3ccc(Cl)cc3)C2)c1
: