Target
Dual specificity protein kinase TTK
Ligand
BDBM230888
Substrate
Meas. Tech.
Kinase Assay
pH
7±n/a
Temperature
298.15±n/a K
IC50
20±n/a nM
Comments
extracted
Citation
 Hoelder, SBlagg, JCheung, KJAtrash, BSheldrake, P Pharmacologically active compounds US Patent  US9334286 Publication Date 5/10/2016 
Target
Name:
Dual specificity protein kinase TTK
Synonyms:
Dual specificity protein kinase (TTK) MPS1 Monopolar Spindle 1 (MPS1) Monopolar Spindle 1 Kinase (MPS1) TTK | TTK_HUMAN
Type:
Protein
Mol. Mass.:
97086.79
Organism:
Homo sapiens (Human)
Description:
P33981
Residue:
857
  
Inhibitor
Name:
BDBM230888
Synonyms:
US10188642, Example 14 | US9334286, 14
Type:
Small organic molecule
Emp. Form.:
C27H28N6O2
Mol. Mass.:
468.5502
SMILES:
COCCn1cc(cn1)-c1ccc2cnc(Nc3ccc(cc3OC)-c3cnc(C)n3C)cc2c1
: