Target
Dual specificity protein kinase TTK
Ligand
BDBM230902
Substrate
Meas. Tech.
Kinase Assay
pH
7±n/a
Temperature
298.15±n/a K
IC50
3±n/a nM
Comments
extracted
Citation
 Hoelder, SBlagg, JCheung, KJAtrash, BSheldrake, P Pharmacologically active compounds US Patent  US9334286 Publication Date 5/10/2016 
Target
Name:
Dual specificity protein kinase TTK
Synonyms:
Dual specificity protein kinase (TTK) MPS1 Monopolar Spindle 1 (MPS1) Monopolar Spindle 1 Kinase (MPS1) TTK | TTK_HUMAN
Type:
Protein
Mol. Mass.:
97086.79
Organism:
Homo sapiens (Human)
Description:
P33981
Residue:
857
  
Inhibitor
Name:
BDBM230902
Synonyms:
US10188642, Example 28 | US9334286, 28
Type:
Small organic molecule
Emp. Form.:
C29H30N6O
Mol. Mass.:
478.5881
SMILES:
COc1cc(ccc1Nc1cc2cc(ccc2cn1)-c1cnn(CC2CCC2)c1)-c1cnc(C)n1C
: