Target
Tyrosine-protein kinase BTK
Ligand
BDBM230104
Substrate
Meas. Tech.
Btk Enzyme Assay
pH
7.4±n/a
Temperature
298.15±n/a K
IC50
0.54±n/a nM
Comments
extracted
Citation
 Batt, DGBertrand, MBDelucca, GGalella, MAKo, SSLangevine, CMLiu, QShi, QSrivastava, ASTino, JAWatterson, SH Substituted tetrahydrocarbazole and carbazole carboxamide compounds US Patent  US9334290 Publication Date 5/10/2016 
Target
Name:
Tyrosine-protein kinase BTK
Synonyms:
AGMX1 Agammaglobulinaemia tyrosine kinase B cell progenitor kinase BPK BTK_HUMAN Tyrosine Kinase BTK Tyrosine-protein kinase BTK (BTK)
Type:
Enzyme
Mol. Mass.:
76289.95
Organism:
Homo sapiens (Human)
Description:
Q06187
Residue:
659
  
Inhibitor
Name:
BDBM230104
Synonyms:
US10106559, Example 62 US9334290, 28 | US9850258, Example 62
Type:
Small organic molecule
Emp. Form.:
C32H30F2N4O4
Mol. Mass.:
572.6018
SMILES:
Cc1c(cccc1-n1c(=O)n(C)c2c(F)cccc2c1=O)-c1c(F)cc(C(N)=O)c2[nH]c3C[C@H](CCc3c12)C(C)(C)O
: