Target
Tyrosine-protein kinase JAK2
Ligand
BDBM230099
Substrate
Meas. Tech.
Jak2 Tyrosine Kinase Assay
pH
7.4±n/a
Temperature
298.15±n/a K
IC50
440±n/a nM
Comments
extracted
Citation
 Batt, DGBertrand, MBDelucca, GGalella, MAKo, SSLangevine, CMLiu, QShi, QSrivastava, ASTino, JAWatterson, SH Substituted tetrahydrocarbazole and carbazole carboxamide compounds US Patent  US9334290 Publication Date 5/10/2016 
Target
Name:
Tyrosine-protein kinase JAK2
Synonyms:
JAK-2 JAK2_HUMAN Janus kinase 2 (JAK2) | Janus kinase 2 (a protein tyrosine kinase)
Type:
Protein
Mol. Mass.:
130684.68
Organism:
Homo sapiens (Human)
Description:
O60674
Residue:
1132
  
Inhibitor
Name:
BDBM230099
Synonyms:
US10106559, Example 24 US9334290, 23 US9850258, Example 24
Type:
Small organic molecule
Emp. Form.:
C33H26ClFN4O4
Mol. Mass.:
597.035
SMILES:
Cc1c(cccc1-n1c(=O)ccn(-c2ccc(F)cc2)c1=O)-c1c(Cl)cc(C(N)=O)c2[nH]c3cc(ccc3c12)C(C)(C)O
: