Target
Tyrosine-protein kinase JAK2
Ligand
BDBM230143
Substrate
Meas. Tech.
Jak2 Tyrosine Kinase Assay
pH
7.4±n/a
Temperature
298.15±n/a K
IC50
4300±n/a nM
Comments
extracted
Citation
 Batt, DGBertrand, MBDelucca, GGalella, MAKo, SSLangevine, CMLiu, QShi, QSrivastava, ASTino, JAWatterson, SH Substituted tetrahydrocarbazole and carbazole carboxamide compounds US Patent  US9334290 Publication Date 5/10/2016 
Target
Name:
Tyrosine-protein kinase JAK2
Synonyms:
JAK-2 JAK2_HUMAN Janus kinase 2 (JAK2) | Janus kinase 2 (a protein tyrosine kinase)
Type:
Protein
Mol. Mass.:
130684.68
Organism:
Homo sapiens (Human)
Description:
O60674
Residue:
1132
  
Inhibitor
Name:
BDBM230143
Synonyms:
US9334290, 74
Type:
Small organic molecule
Emp. Form.:
C32H26F2N4O4
Mol. Mass.:
568.57
SMILES:
Cc1c(cccc1-n1c(=O)n(C)c2c(F)cccc2c1=O)-c1c(F)cc(C(N)=O)c2[nH]c3cc(ccc3c12)C(C)(C)O
: