Target
Transient receptor potential cation channel subfamily V member 4
Ligand
BDBM230219
Substrate
Meas. Tech.
Inhibition Assay
Temperature
310.15±n/a K
IC50
510±n/a nM
Comments
extracted
Citation
 Yukimasa, A Aromatic heterocyclic derivative having TRPV4-inhibiting activity US Patent  US9340500 Publication Date 5/17/2016 
Target
Name:
Transient receptor potential cation channel subfamily V member 4
Synonyms:
TRPV4 Transient receptor potential cation channel subfamily V member 4 (TRPV4) VROAC
Type:
Enzyme
Mol. Mass.:
98290.10
Organism:
Homo sapiens (Human)
Description:
Q9HBA0
Residue:
871
  
Inhibitor
Name:
BDBM230219
Synonyms:
US9340500, I-063
Type:
Small organic molecule
Emp. Form.:
C27H25F3N4O3
Mol. Mass.:
510.5076
SMILES:
CN(CCCn1c(C)c(cc1-c1ccccc1)C(=O)Nc1cccc(c1)C(F)(F)F)C(=O)c1ccno1
: