Target
Transient receptor potential cation channel subfamily V member 4
Ligand
BDBM230175
Substrate
Meas. Tech.
Inhibition Assay
Temperature
310.15±n/a K
Ki
1495±n/a nM
Comments
extracted
Citation
 Yukimasa, A Aromatic heterocyclic derivative having TRPV4-inhibiting activity US Patent  US9340500 Publication Date 5/17/2016 
Target
Name:
Transient receptor potential cation channel subfamily V member 4
Synonyms:
TRPV4 Transient receptor potential cation channel subfamily V member 4 (TRPV4) VROAC
Type:
Enzyme
Mol. Mass.:
98290.10
Organism:
Homo sapiens (Human)
Description:
Q9HBA0
Residue:
871
  
Inhibitor
Name:
BDBM230175
Synonyms:
US9340500, I-019
Type:
Small organic molecule
Emp. Form.:
C22H26N4O2S
Mol. Mass.:
410.532
SMILES:
Cc1c(cc(-c2ccccc2)n1CCCN1CCOCC1)C(=O)Nc1nccs1
: