Target
Neutrophil elastase
Ligand
BDBM230301
Substrate
Meas. Tech.
Human Neutrophil Elastase Assay
pH
7.5±n/a
Temperature
298.15±n/a K
IC50
64±n/a nM
Comments
extracted
Citation
 Oost, TFiegen, DGnamm, CHandschuh, SPeters, SRoth, GJ Substituted 4-pyridones and their use as inhibitors of neutrophil elastase activity US Patent  US9340507 Publication Date 5/17/2016 
Target
Name:
Neutrophil elastase
Synonyms:
Bone marrow serine protease Coagulation factor X ELANE Elastase HLE Leukocyte elastase Medullasin Neutrophil elastase (HNE) PMN elastase Trypsin
Type:
Enzyme
Mol. Mass.:
28532.38
Organism:
Homo sapiens (Human)
Description:
P08246
Residue:
267
  
Inhibitor
Name:
BDBM230301
Synonyms:
US9340507, 3.5
Type:
Small organic molecule
Emp. Form.:
C25H22F3N3O2
Mol. Mass.:
453.4563
SMILES:
CC(C)n1cc(C(=O)NCc2ccc(cc2)C#N)c(=O)c(c1C)-c1cccc(c1)C(F)(F)F
: