Target
Neutrophil elastase
Ligand
BDBM230391
Substrate
Meas. Tech.
Human Neutrophil Elastase Assay
pH
7.5±n/a
Temperature
298.15±n/a K
IC50
38±n/a nM
Comments
extracted
Citation
 Oost, TFiegen, DGnamm, CHandschuh, SPeters, SRoth, GJ Substituted 4-pyridones and their use as inhibitors of neutrophil elastase activity US Patent  US9340507 Publication Date 5/17/2016 
Target
Name:
Neutrophil elastase
Synonyms:
Bone marrow serine protease Coagulation factor X ELANE Elastase HLE Leukocyte elastase Medullasin Neutrophil elastase (HNE) PMN elastase Trypsin
Type:
Enzyme
Mol. Mass.:
28532.38
Organism:
Homo sapiens (Human)
Description:
P08246
Residue:
267
  
Inhibitor
Name:
BDBM230391
Synonyms:
US9340507, 47
Type:
Small organic molecule
Emp. Form.:
C26H27F3N2O5S
Mol. Mass.:
536.563
SMILES:
COc1cc(ccc1CNC(=O)c1cn(C(C)C)c(C)c(-c2cccc(c2)C(F)(F)F)c1=O)S(C)(=O)=O
: