Target
Melanocyte-stimulating hormone receptor
Ligand
BDBM230656
Substrate
Meas. Tech.
Radioligand Binding Assay
pH
7.4±n/a
Temperature
277.15±n/a K
IC50
6660±n/a nM
Comments
extracted
Citation
 Blaskovich, MACassidy, PJ Methods of modulating the activity of the MC5 receptor and treatment of conditions related to this receptor US Patent  US9340517 Publication Date 5/17/2016 
Target
Name:
Melanocyte-stimulating hormone receptor
Synonyms:
MC1-R MSH-R MSHR_HUMAN Melanocortin receptor (M1 and M4) Melanocortin receptor 1 (MC1-R) | Melanocortin receptor 1 (MC1R)
Type:
Enzyme
Mol. Mass.:
34717.23
Organism:
Homo sapiens (Human)
Description:
Q01726
Residue:
317
  
Inhibitor
Name:
BDBM230656
Synonyms:
US9340517, 105
Type:
Small organic molecule
Emp. Form.:
C35H40N6O2
Mol. Mass.:
576.7311
SMILES:
NC(=N)NCCC[C@H]1N[C@@H](CNC(=O)c2ccc3ccccc3c2)CCN(CC(c2ccccc2)c2ccccc2)C1=O
: