Target
Melanocyte-stimulating hormone receptor
Ligand
BDBM230658
Substrate
Meas. Tech.
Radioligand Binding Assay
pH
7.4±n/a
Temperature
277.15±n/a K
IC50
2850±n/a nM
Comments
extracted
Citation
 Blaskovich, MACassidy, PJ Methods of modulating the activity of the MC5 receptor and treatment of conditions related to this receptor US Patent  US9340517 Publication Date 5/17/2016 
Target
Name:
Melanocyte-stimulating hormone receptor
Synonyms:
MC1-R MSH-R MSHR_HUMAN Melanocortin receptor (M1 and M4) Melanocortin receptor 1 (MC1-R) | Melanocortin receptor 1 (MC1R)
Type:
Enzyme
Mol. Mass.:
34717.23
Organism:
Homo sapiens (Human)
Description:
Q01726
Residue:
317
  
Inhibitor
Name:
BDBM230658
Synonyms:
US9340517, 33
Type:
Small organic molecule
Emp. Form.:
C36H43ClN4O2
Mol. Mass.:
599.205
SMILES:
Clc1ccc(\C=C\C(=O)NC[C@H]2CCN(CC(c3ccccc3)c3ccccc3)C(=O)[C@@H](CCN3CCCCC3)N2)cc1
: