Target
Melanocortin receptor 5
Ligand
BDBM231699
Substrate
Meas. Tech.
Radioligand Binding Assay
pH
7.4±n/a
Temperature
310.15±n/a K
IC50
<100±n/a nM
Comments
extracted
Citation
 Blaskovich, MACassidy, PJ Methods of modulating the activity of the MC5 receptor and treatment of conditions related to this receptor US Patent  US9340517 Publication Date 5/17/2016 
Target
Name:
Melanocortin receptor 5
Synonyms:
MC-2 MC5R Melanocortin MC5 Melanocortin receptor 5 | Melanocortin receptor 5 (MC5R)
Type:
Enzyme
Mol. Mass.:
36612.92
Organism:
Homo sapiens (Human)
Description:
P33032
Residue:
325
  
Inhibitor
Name:
BDBM231699
Synonyms:
US9340517, 14
Type:
Small Organic Molecule
Emp. Form.:
C28H32Cl2N6O2
Mol. Mass.:
555.499
SMILES:
NC(=N)NCCC[C@@H]1NC(CNC(=O)c2ccc3ccccc3c2)CCN(Cc2cc(Cl)cc(Cl)c2)C1=O
: