Target
Melanocortin receptor 5
Ligand
BDBM232133
Substrate
Meas. Tech.
Radioligand Binding Assay
pH
7.4±n/a
Temperature
310.15±n/a K
IC50
<100±n/a nM
Comments
extracted
Citation
 Blaskovich, MACassidy, PJ Methods of modulating the activity of the MC5 receptor and treatment of conditions related to this receptor US Patent  US9340517 Publication Date 5/17/2016 
Target
Name:
Melanocortin receptor 5
Synonyms:
MC-2 MC5R Melanocortin MC5 Melanocortin receptor 5 | Melanocortin receptor 5 (MC5R)
Type:
Enzyme
Mol. Mass.:
36612.92
Organism:
Homo sapiens (Human)
Description:
P33032
Residue:
325
  
Inhibitor
Name:
BDBM232133
Synonyms:
US9340517, 521
Type:
Small Organic Molecule
Emp. Form.:
C30H38Cl2F2N4O2
Mol. Mass.:
595.551
SMILES:
CC[C@H](CN1CC[C@H](CNC(=O)c2ccc(Cl)c(Cl)c2)N[C@H](CCN2CCC(F)(F)CC2)C1=O)c1ccccc1
: