Target
Proteinase-activated receptor 1
Ligand
BDBM230684
Substrate
Meas. Tech.
FLIPR Assay
IC50
1.2±n/a nM
Citation
 Mandal, MBlizzard, TAChen, HChobanian, HGuo, YPio, BWu, ZBiftu, TGreenlee, WJZhu, JZ Preparation and use of bicyclic himbacine derivatives as PAR-1 receptor antagonists US Patent  US9340530 Publication Date 5/17/2016 
Target
Name:
Proteinase-activated receptor 1
Synonyms:
CF2R F2R PAR1 Proteinase activated receptor 1 TR Thrombin receptor/ Proteinase-activated receptor 1(Par-1)
Type:
Protein
Mol. Mass.:
47450.07
Organism:
Homo sapiens (Human)
Description:
P25116
Residue:
425
  
Inhibitor
Name:
BDBM230684
Synonyms:
US9340530, 21a | US9340530, 21b
Type:
Small organic molecule
Emp. Form.:
C28H25F2N3O3S
Mol. Mass.:
521.578
SMILES:
C[C@H]1OC(=O)[C@@]2(CC(F)(F)C(C)[C@H](\C=C\c3ccc(cn3)-c3ccccc3C#N)C12)C(O)c1nccs1
: