Target
Proteinase-activated receptor 1
Ligand
BDBM230711
Substrate
Meas. Tech.
FLIPR Assay
IC50
3.1±n/a nM
Citation
 Mandal, MBlizzard, TAChen, HChobanian, HGuo, YPio, BWu, ZBiftu, TGreenlee, WJZhu, JZ Preparation and use of bicyclic himbacine derivatives as PAR-1 receptor antagonists US Patent  US9340530 Publication Date 5/17/2016 
Target
Name:
Proteinase-activated receptor 1
Synonyms:
CF2R F2R PAR1 Proteinase activated receptor 1 TR Thrombin receptor/ Proteinase-activated receptor 1(Par-1)
Type:
Protein
Mol. Mass.:
47450.07
Organism:
Homo sapiens (Human)
Description:
P25116
Residue:
425
  
Inhibitor
Name:
BDBM230711
Synonyms:
US9340530, 46
Type:
Small organic molecule
Emp. Form.:
C30H28F2N4O2
Mol. Mass.:
514.5657
SMILES:
[H][C@@]12[C@@H](C)OC(=O)[C@@]1(CC(F)(F)[C@@]([H])(C)[C@@H]2\C=C\c1ccc(cn1)-c1ccccc1C#N)NCc1ccccn1
: