Target
Proteinase-activated receptor 1
Ligand
BDBM230737
Substrate
Meas. Tech.
FLIPR Assay
IC50
2.5±n/a nM
Citation
 Mandal, MBlizzard, TAChen, HChobanian, HGuo, YPio, BWu, ZBiftu, TGreenlee, WJZhu, JZ Preparation and use of bicyclic himbacine derivatives as PAR-1 receptor antagonists US Patent  US9340530 Publication Date 5/17/2016 
Target
Name:
Proteinase-activated receptor 1
Synonyms:
CF2R F2R PAR1 Proteinase activated receptor 1 TR Thrombin receptor/ Proteinase-activated receptor 1(Par-1)
Type:
Protein
Mol. Mass.:
47450.07
Organism:
Homo sapiens (Human)
Description:
P25116
Residue:
425
  
Inhibitor
Name:
BDBM230737
Synonyms:
US9340530, 72
Type:
Small organic molecule
Emp. Form.:
C25H24F2N2O3
Mol. Mass.:
438.4665
SMILES:
CO[C@@]12CC(F)(F)[C@@H](C)[C@H](\C=C\c3ccc(cn3)-c3ccccc3C#N)[C@@H]1[C@@H](C)OC2=O
: