Target
Tyrosine-protein kinase ABL1 [64-515]
Ligand
BDBM230805
Substrate
Meas. Tech.
Radiometric Filter-Binding Assay
pH
7.5±n/a
Temperature
298.15±n/a K
IC50
26±n/a nM
Comments
extracted
Citation
 Furet, PGrotzfeld, RMJahnke, WJones, DBManley, PWMarzinzik, APelle, XFSalem, BSchoepfer, J Benzamide derivatives for inhibiting the activity of ABL1, ABL2 and BCR-ABL1 US Patent  US9340537 Publication Date 5/17/2016 
Target
Name:
Tyrosine-protein kinase ABL1 [64-515]
Synonyms:
ABL ABL1_HUMAN Tyrosine-protein kinase ABL1 Tyrosine-protein kinase ABL1 (ABL) | Tyrosine-protein kinase ABL1 (ABL1)
Type:
Enzyme Catalytic Domain
Mol. Mass.:
51539.77
Organism:
Homo sapiens (Human)
Description:
aa 64-515
Residue:
452
  
Inhibitor
Name:
BDBM230805
Synonyms:
US9340537, 59 | US9896444, Example 59
Type:
Small organic molecule
Emp. Form.:
C22H21ClF4N6O2
Mol. Mass.:
512.888
SMILES:
FC(F)CN1CCN(CC1)c1ncc(cc1-c1ccn[nH]1)C(=O)Nc1ccc(OC(F)(F)Cl)cc1
: